SnI3 anion
- Formula: I3Sn-
- Molecular weight: 499.424

Reaction thermochemistry data

Data compiled by: John E. Bartmess
Individual Reactions
By formula: I3Sn- + H+ = HI3Si
Quantity | Value | Units | Method | Reference | Comment |
---|---|---|---|---|---|
ΔrH° | 274.60 | kcal/mol | N/A | Check, Faust, et al., 2001 | gas phase; NiO2-(q); ; ΔS(EA)=5.0 |
Quantity | Value | Units | Method | Reference | Comment |
ΔrG° | 269.70 | kcal/mol | N/A | Check, Faust, et al., 2001 | gas phase; NiO2-(q); ; ΔS(EA)=5.0 |

Gas phase ion energetics data

Data compiled by: John E. Bartmess
Electron affinity of neutral species
EAneutral (eV) | Method | Reference | Comment |
---|---|---|---|
3.21 ± 0.10 | EIAE | Pabst, Margrave, et al., 1978 | From SnI4 |
3.20999 | EIAE | Pabst, Perry, et al., 1977 | From SnI4 |
3.92194 | N/A | Check, Faust, et al., 2001 | NiO2-(q); ; ΔS(EA)=5.0 |
Protonation reactions
By formula: I3Sn- + H+ = HI3Si
Quantity | Value | Units | Method | Reference | Comment |
---|---|---|---|---|---|
ΔrH° | 274.60 | kcal/mol | N/A | Check, Faust, et al., 2001 | gas phase; NiO2-(q); ; ΔS(EA)=5.0 |
Quantity | Value | Units | Method | Reference | Comment |
ΔrG° | 269.70 | kcal/mol | N/A | Check, Faust, et al., 2001 | gas phase; NiO2-(q); ; ΔS(EA)=5.0 |

References

Check, Faust, et al., 2001
Check, C.E.; Faust, T.O.; Bailey, J.M.; Wright, B.J.; Gilbert, T.M.; Sunderlin, L.S.,
Addition of Polarization and Diffuse Functions to the LANL2DZ Basis Set for P-Block Elements,
J. Phys. Chem. A,, 2001, 105, 34, 8111, https://doi.org/10.1021/jp011945l
. [all data]
Pabst, Margrave, et al., 1978
Pabst, R.E.; Margrave, J.L.; Franklin, J.L.,
Energy distribution in the products of ionic decomposition,
Adv. Mass Spectrom., 1978, 7, 1217. [all data]
Pabst, Perry, et al., 1977
Pabst, R.E.; Perry, D.L.; Margrave, J.L.; Franklin, J.L.,
Electron impact studies of tin tetrahalides SnCl4, SnBr4 and SnI4,
Int. J. Mass Spectrom. Ion Phys., 1977, 24, 323. [all data]