H2O..PhO anion
- Formula: C6H7O2-
- Molecular weight: 111.1191

Gas phase thermochemistry data

Data compiled by: John E. Bartmess
Quantity | Value | Units | Method | Reference | Comment |
---|---|---|---|---|---|
ΔfH°gas | -472. ± 10. | kJ/mol | Ther | Meot-Ner and Sieck, 1986 |

Reaction thermochemistry data

Data compiled by: John E. Bartmess
Individual Reactions
By formula: C6H5O- + H2O = C6H7O2-
Quantity | Value | Units | Method | Reference | Comment |
---|---|---|---|---|---|
ΔrH° | 64.4 ± 4.2 | kJ/mol | N/A | Meot-Ner and Sieck, 1986 | gas phase |
Quantity | Value | Units | Method | Reference | Comment |
ΔrG° | 34. ± 6.7 | kJ/mol | TDAs | Meot-Ner and Sieck, 1986 | gas phase |

Ion clustering data

Data compiled by: John E. Bartmess
Clustering reactions
By formula: C6H5O- + H2O = C6H7O2-
Quantity | Value | Units | Method | Reference | Comment |
---|---|---|---|---|---|
ΔrH° | 64.4 ± 4.2 | kJ/mol | N/A | Meot-Ner and Sieck, 1986 | gas phase |
Quantity | Value | Units | Method | Reference | Comment |
ΔrG° | 34. ± 6.7 | kJ/mol | TDAs | Meot-Ner and Sieck, 1986 | gas phase |

References

Meot-Ner and Sieck, 1986
Meot-Ner, M.; Sieck, L.W.,
The ionic hydrogen bond and ion solvation. 5. OH...O- bonds. Gas phase solvation and clustering of alkoxide and carboxylate anions,
J. Am. Chem. Soc., 1986, 108, 7525. [all data]