CeI2 radical anion
- Formula: CeI2-
- Molecular weight: 393.925

Gas phase thermochemistry data

Data compiled by: John E. Bartmess
Quantity | Value | Units | Method | Reference | Comment |
---|---|---|---|---|---|
ΔfH°gas | <-52.9 ± 5.5 | kcal/mol | R-EA | Chantry, 1976 | From CeI3 |

References

Chantry, 1976
Chantry, P.J.,
Negative Ion Formation in Cerium Triiodide,
J. Chem. Phys., 1976, 65, 11, 4412, https://doi.org/10.1063/1.432992
. [all data]