Xe..F anion
- Formula: FXe-
- Molecular weight: 150.292

Gas phase thermochemistry data

Data compiled by: John E. Bartmess
Quantity | Value | Units | Method | Reference | Comment |
---|---|---|---|---|---|
ΔfH°gas | -275.2 ± 1.3 | kJ/mol | Ther | Wada, Kikkawa, et al., 2007 | |
ΔfH°gas | -276.0 ± 3.8 | kJ/mol | Ther | De Vreugd, Wijnaendts van Resandt, et al., 1979 |

Ion clustering data

Data compiled by: John E. Bartmess
Clustering reactions
FXe- + 2 = FXe2-
By formula: FXe- + 2Xe = FXe2-
Quantity | Value | Units | Method | Reference | Comment |
---|---|---|---|---|---|
ΔrH° | 21.8 ± 1.3 | kJ/mol | TDAs | Wada, Kikkawa, et al., 2007 | gas phase |
Quantity | Value | Units | Method | Reference | Comment |
ΔrG° | 0.5 ± 1.3 | kJ/mol | TDAs | Wada, Kikkawa, et al., 2007 | gas phase |

Reaction thermochemistry data

Data compiled by: John E. Bartmess

Individual Reactions

FXe- + 2Xenon = FXe2-

By formula: FXe- + 2Xe = FXe2-

Quantity Value Units Method Reference Comment
Δr5.20 ± 0.30kcal/molTDAsWada, Kikkawa, et al., 2007gas phase
Quantity Value Units Method Reference Comment
Δr0.13 ± 0.30kcal/molTDAsWada, Kikkawa, et al., 2007gas phase

References

Wada, Kikkawa, et al., 2007
Wada, A.; Kikkawa, A.; Sugiyama, T.; Hiraoka, K.,
Thermochemical Stabilities of the Gas-phase Cluster Ions of Halide Ions with Rare Gas Atoms,
Int. J. Mass Spectrom.., 2007, 267, 1-3, 284-287, https://doi.org/10.1016/j.ijms.2007.02.053
. [all data]
De Vreugd, Wijnaendts van Resandt, et al., 1979
De Vreugd, C.; Wijnaendts van Resandt, R.W.; Los, J.,
The Well Depths of XeF- and XeCl- from Differential Scattering Measurements,
Chem. Phys. Lett., 1979, 65, 1, 93, https://doi.org/10.1016/0009-2614(79)80134-7
. [all data]