Xe..Cl anion
- Formula: ClXe-
- Molecular weight: 166.747

Gas phase thermochemistry data

Data compiled by: John E. Bartmess
Quantity | Value | Units | Method | Reference | Comment |
---|---|---|---|---|---|
ΔfH°gas | -244.9 | kJ/mol | Ther | Wada, Kikkawa, et al., 2007 | |
ΔfH°gas | -240.3 | kJ/mol | Ther | Gatland, 1984 | |
ΔfH°gas | -240.3 | kJ/mol | Ther | Thackston, Eisele, et al., 1980 | |
ΔfH°gas | >-240.7 | kJ/mol | Ther | De Vreugd, Wijnaendts van Resandt, et al., 1979 |

Ion clustering data

Data compiled by: John E. Bartmess
Clustering reactions
ClXe- + 2 = ClXe2-
By formula: ClXe- + 2Xe = ClXe2-
Quantity | Value | Units | Method | Reference | Comment |
---|---|---|---|---|---|
ΔrH° | 15.5 ± 1.7 | kJ/mol | TDAs | Wada, Kikkawa, et al., 2007 | gas phase |
Quantity | Value | Units | Method | Reference | Comment |
ΔrG° | -9.5 ± 1.7 | kJ/mol | TDAs | Wada, Kikkawa, et al., 2007 | gas phase |

Reaction thermochemistry data

Data compiled by: John E. Bartmess

Individual Reactions

ClXe- + 2Xenon = ClXe2-

By formula: ClXe- + 2Xe = ClXe2-

Quantity Value Units Method Reference Comment
Δr15.5 ± 1.7kJ/molTDAsWada, Kikkawa, et al., 2007gas phase
Quantity Value Units Method Reference Comment
Δr-9.5 ± 1.7kJ/molTDAsWada, Kikkawa, et al., 2007gas phase

References

Wada, Kikkawa, et al., 2007
Wada, A.; Kikkawa, A.; Sugiyama, T.; Hiraoka, K.,
Thermochemical Stabilities of the Gas-phase Cluster Ions of Halide Ions with Rare Gas Atoms,
Int. J. Mass Spectrom.., 2007, 267, 1-3, 284-287, https://doi.org/10.1016/j.ijms.2007.02.053
. [all data]
Gatland, 1984
Gatland, I.R.,
Determination of Ion-Atom Potentials from Mobility Experiments.
in Swarms of Ions and Electrons In Gases, W. Lindinger, Ed., Springer-Verlag, NY,, 1984, 44. [all data]
Thackston, Eisele, et al., 1980
Thackston, M.G.; Eisele, F.L.; Pope, W.M.; Ellis, H.W.; McDaniel, E.W.; Gatland, I.R.,
Mobility of Cl- ions in Xe gas and the Cl--Xe interaction potential,
J. Chem. Phys., 1980, 73, 3183. [all data]
De Vreugd, Wijnaendts van Resandt, et al., 1979
De Vreugd, C.; Wijnaendts van Resandt, R.W.; Los, J.,
The Well Depths of XeF- and XeCl- from Differential Scattering Measurements,
Chem. Phys. Lett., 1979, 65, 1, 93, https://doi.org/10.1016/0009-2614(79)80134-7
. [all data]