HCO2H..I anion
- Formula: CH2IO2-
- Molecular weight: 172.9304

Reaction thermochemistry data

Data compiled by: John E. Bartmess
Individual Reactions
CH2IO2- + 2 = C2H4IO4-
By formula: CH2IO2- + 2CH2O2 = C2H4IO4-
Quantity | Value | Units | Method | Reference | Comment |
---|---|---|---|---|---|
ΔrH° | 41.8 ± 8.8 | kJ/mol | CIDT | Walker and Sunderlin, 1999 | gas phase |

Gas phase thermochemistry data

Data compiled by: John E. Bartmess
Quantity | Value | Units | Method | Reference | Comment |
---|---|---|---|---|---|
ΔfH°gas | -154.4 ± 1.0 | kcal/mol | Ther | Caldwell and Kebarle, 1984 |

Ion clustering data

Data compiled by: John E. Bartmess
Clustering reactions
CH2IO2- + 2 = C2H4IO4-
By formula: CH2IO2- + 2CH2O2 = C2H4IO4-
Quantity | Value | Units | Method | Reference | Comment |
---|---|---|---|---|---|
ΔrH° | 10.0 ± 2.1 | kcal/mol | CIDT | Walker and Sunderlin, 1999 | gas phase |

References

Walker and Sunderlin, 1999
Walker, B.W.; Sunderlin, L.S.,
The thermochemistry of formic acid halide anion clusters,
Int. J. Mass Spectrom., 1999, 184, 2-3, 183-189, https://doi.org/10.1016/S1387-3806(99)00008-1
. [all data]