pCl-phenol..Cl anion

Gas phase thermochemistry data

Data compiled by: John E. Bartmess

Quantity Value Units Method Reference Comment
Δfgas-496.77kJ/molTherCummings, French, et al., 1977Re-anchored to data in French, Ikuta, et al., 1982.

References

Cummings, French, et al., 1977
Cummings, J.B.; French, M.A.; Kebarle, P., Effect of charge delocalization on hydrogen bonding to negative ions and solvation of negative ions. Substituted phenols and phenoxide ions, J. Am. Chem. Soc., 1977, 99, 6999. [all data]

French, Ikuta, et al., 1982
French, M.A.; Ikuta, S.; Kebarle, P., Hydrogen bonding of O-H and C-H hydrogen donors to Cl-. Results from mass spectrometric measurement of the ion-molecule equilibria RH + Cl- = RHCl-, Can. J. Chem., 1982, 60, 1907. [all data]