ScF3..ScF4 anion
- Formula: F7Sc2-
- Molecular weight: 222.901195

Reaction thermochemistry data

Data compiled by: John E. Bartmess
Individual Reactions
By formula: F4Sc- + F3Sc = F7Sc2-
Quantity | Value | Units | Method | Reference | Comment |
---|---|---|---|---|---|
ΔrH° | 54.50 ± 0.20 | kcal/mol | TDAs | Nikitin, Sidorov, et al., 1981 | gas phase |
Quantity | Value | Units | Method | Reference | Comment |
ΔrG° | 47.50 ± 0.30 | kcal/mol | TDAs | Nikitin, Sidorov, et al., 1981 | gas phase |

Ion clustering data

Data compiled by: John E. Bartmess
Clustering reactions
By formula: F4Sc- + F3Sc = F7Sc2-
Quantity | Value | Units | Method | Reference | Comment |
---|---|---|---|---|---|
ΔrH° | 54.50 ± 0.20 | kcal/mol | TDAs | Nikitin, Sidorov, et al., 1981 | gas phase |
Quantity | Value | Units | Method | Reference | Comment |
ΔrG° | 47.50 ± 0.30 | kcal/mol | TDAs | Nikitin, Sidorov, et al., 1981 | gas phase |

References

Nikitin, Sidorov, et al., 1981
Nikitin, M.I.; Sidorov, L.N.; Skokan, E.V.; Sorokin, I.D.,
Mass spectrometric determination of the heats of formation of ScF4- and KF2-,
Russ. J. Phys. Chem., 1981, 55, 1107. [all data]