m-Trifluoromethylbenzonitrile anion

Gas phase thermochemistry data

Data compiled by: John E. Bartmess

Quantity Value Units Method Reference Comment
Δfgas-518. ± 10.kJ/molR-EAChowdhury and Kebarle, 1986ΔGea(423 K) = -15.5 kcal/mol; ΔSea (estimated) = 0. eu.

References

Chowdhury and Kebarle, 1986
Chowdhury, S.; Kebarle, P., Electron affinities of di- and tetracyanoethylene and cyanobenzenes based on measurements of gas-phase electron transfer equilibria, J. Am. Chem. Soc., 1986, 108, 5453. [all data]