SO3..Cl anion

Gas phase thermochemistry data

Data compiled by: John E. Bartmess

Quantity Value Units Method Reference Comment
Δfgas-848.31kJ/molTherHao, Gilbert, et al., 20060K threshold 53.0 kcal/mol. scaled to 298K with B3LYP data.

References

Hao, Gilbert, et al., 2006
Hao, C.; Gilbert, T.M.; Sunderlin, L.S., The Bond Dissociation Energies of SO3-X- (X = F, Cl, Br, and I), Can. J. Chem., 2006, 83, 11, 2013-2019, https://doi.org/10.1139/v05-216 . [all data]