oF-C6H3OMe anion

Reaction thermochemistry data

Data compiled by: John E. Bartmess

Individual Reactions

C7H6FO- + Hydrogen cation = Benzene, 1-fluoro-2-methoxy-

By formula: C7H6FO- + H+ = C7H7FO

Quantity Value Units Method Reference Comment
Δr1618. ± 21.kJ/molG+TSIngemann and Nibbering, 1983gas phase; Between H2O, MeOH
Quantity Value Units Method Reference Comment
Δr1586. ± 21.kJ/molIMRBIngemann and Nibbering, 1983gas phase; Between H2O, MeOH

References

Ingemann and Nibbering, 1983
Ingemann, S.; Nibbering, N.M.M., Gas phase reactions of anions with 2-,3-, and 4-fluoroanisole, J. Org. Chem., 1983, 48, 183. [all data]