pF-C6H3OMe anion
- Formula: C7H6FO-
- Molecular weight: 125.1209

Reaction thermochemistry data

Data compiled by: John E. Bartmess
Individual Reactions
By formula: C7H6FO- + H+ = C7H7FO
Quantity | Value | Units | Method | Reference | Comment |
---|---|---|---|---|---|
ΔrH° | 1618. ± 21. | kJ/mol | G+TS | Ingemann and Nibbering, 1983 | gas phase; Between H2O, MeOH |
Quantity | Value | Units | Method | Reference | Comment |
ΔrG° | 1586. ± 21. | kJ/mol | IMRB | Ingemann and Nibbering, 1983 | gas phase; Between H2O, MeOH |

Gas phase ion energetics data

Data compiled by: John E. Bartmess
Protonation reactions
By formula: C7H6FO- + H+ = C7H7FO
Quantity | Value | Units | Method | Reference | Comment |
---|---|---|---|---|---|
ΔrH° | 1618. ± 21. | kJ/mol | G+TS | Ingemann and Nibbering, 1983 | gas phase; Between H2O, MeOH |
Quantity | Value | Units | Method | Reference | Comment |
ΔrG° | 1586. ± 21. | kJ/mol | IMRB | Ingemann and Nibbering, 1983 | gas phase; Between H2O, MeOH |

References

Ingemann and Nibbering, 1983
Ingemann, S.; Nibbering, N.M.M.,
Gas phase reactions of anions with 2-,3-, and 4-fluoroanisole,
J. Org. Chem., 1983, 48, 183. [all data]