Be2F5 anion
- Formula: Be2F5-
- Molecular weight: 113.016929

Reaction thermochemistry data

Data compiled by: John E. Bartmess
Individual Reactions
Be2F5- + BeF3K = (Be2F5- • BeF3K)
By formula: Be2F5- + BeF3K = (Be2F5- • BeF3K)
Quantity | Value | Units | Method | Reference | Comment |
---|---|---|---|---|---|
ΔrH° | 44.9 ± 2.0 | kcal/mol | N/A | Nikitin, Sorokin, et al., 1980 | gas phase; value altered from reference due to conversion from electron convention to ion convention |
By formula: Be2F5- + FNa = (Be2F5- • FNa)
Quantity | Value | Units | Method | Reference | Comment |
---|---|---|---|---|---|
ΔrH° | 65.2 ± 2.5 | kcal/mol | N/A | Nikitin, Sorokin, et al., 1980 | gas phase; value altered from reference due to conversion from electron convention to ion convention |
Be2F5- + BeF2 = (Be2F5- • BeF2)
By formula: Be2F5- + BeF2 = (Be2F5- • BeF2)
Quantity | Value | Units | Method | Reference | Comment |
---|---|---|---|---|---|
ΔrH° | 41.8 ± 2.5 | kcal/mol | N/A | Nikitin, Sorokin, et al., 1980 | gas phase; value altered from reference due to conversion from electron convention to ion convention |
By formula: Be2F5- + FK = (Be2F5- • FK)
Quantity | Value | Units | Method | Reference | Comment |
---|---|---|---|---|---|
ΔrH° | 69.2 ± 2.5 | kcal/mol | N/A | Nikitin, Sorokin, et al., 1980 | gas phase; value altered from reference due to conversion from electron convention to ion convention |

Ion clustering data

Data compiled by: John E. Bartmess
Clustering reactions
Be2F5- + BeF2 = (Be2F5- • BeF2)
By formula: Be2F5- + BeF2 = (Be2F5- • BeF2)
Quantity | Value | Units | Method | Reference | Comment |
---|---|---|---|---|---|
ΔrH° | 41.8 ± 2.5 | kcal/mol | N/A | Nikitin, Sorokin, et al., 1980 | gas phase; value altered from reference due to conversion from electron convention to ion convention |
Be2F5- + BeF3K = (Be2F5- • BeF3K)
By formula: Be2F5- + BeF3K = (Be2F5- • BeF3K)
Quantity | Value | Units | Method | Reference | Comment |
---|---|---|---|---|---|
ΔrH° | 44.9 ± 2.0 | kcal/mol | N/A | Nikitin, Sorokin, et al., 1980 | gas phase; value altered from reference due to conversion from electron convention to ion convention |
By formula: Be2F5- + FK = (Be2F5- • FK)
Quantity | Value | Units | Method | Reference | Comment |
---|---|---|---|---|---|
ΔrH° | 69.2 ± 2.5 | kcal/mol | N/A | Nikitin, Sorokin, et al., 1980 | gas phase; value altered from reference due to conversion from electron convention to ion convention |
By formula: Be2F5- + FNa = (Be2F5- • FNa)
Quantity | Value | Units | Method | Reference | Comment |
---|---|---|---|---|---|
ΔrH° | 65.2 ± 2.5 | kcal/mol | N/A | Nikitin, Sorokin, et al., 1980 | gas phase; value altered from reference due to conversion from electron convention to ion convention |

Gas phase thermochemistry data

Data compiled by: John E. Bartmess

Quantity Value Units Method Reference Comment
Δfgas-2445. ± 17.kJ/molTherNikitin, Sorokin, et al., 1980Fluoride Affinity of Be2F4: 6.3±2 kcal < AlF3; value altered from reference due to conversion from electron convention to ion convention

References

Nikitin, Sorokin, et al., 1980
Nikitin, M.I.; Sorokin, I.D.; Skokan, E.V.; Sidorov, L.N.,
Negative Ions in the Saturated Vapors of the Potassium Fluoride - Hafnium Tetrafluoride and Potassium Fluoride - Beryllium Difluoride Systems,
Russ. J. Phys. Chem., 1980, 54, page]. [all data]