BeF2..AlF4 anion
- Formula: AlBeF6-
- Molecular weight: 149.984688

Gas phase thermochemistry data

Data compiled by: John E. Bartmess
Quantity | Value | Units | Method | Reference | Comment |
---|---|---|---|---|---|
ΔfH°gas | -697.3 ± 3.6 | kcal/mol | Ther | Nikitin, Sorokin, et al., 1980 | value altered from reference due to conversion from electron convention to ion convention |

References

Nikitin, Sorokin, et al., 1980
Nikitin, M.I.; Sorokin, I.D.; Skokan, E.V.; Sidorov, L.N.,
Negative Ions in the Saturated Vapors of the Potassium Fluoride - Hafnium Tetrafluoride and Potassium Fluoride - Beryllium Difluoride Systems,
Russ. J. Phys. Chem., 1980, 54, page]. [all data]