Fe(CO)4 anion

Gas phase thermochemistry data

Data compiled by: John E. Bartmess

Quantity Value Units Method Reference Comment
Δfgas-673. ± 15.kJ/molR-EANakajima, Taguwa, et al., 1994Vertical Detachment Energy: 3.02±0.13 eV

References

Nakajima, Taguwa, et al., 1994
Nakajima, A.; Taguwa, T.; Kaya, K., Photoelectron Spectroscopy of Iron Carbonyl Cluster Anions (Fen(CO)m(-), n=1-4), Chem. Phys. Lett., 1994, 221, 5-6, 436, https://doi.org/10.1016/0009-2614(94)00301-7 . [all data]