CuF2..F anion
- Formula: CuF3-
- Molecular weight: 120.542

Gas phase thermochemistry data

Data compiled by: John E. Bartmess
Quantity | Value | Units | Method | Reference | Comment |
---|---|---|---|---|---|
ΔfH°gas | -207.0 ± 5.1 | kcal/mol | Ther | Kuznetsov, Korobov, et al., 1986 | Anchor:F-(FeF3) Chilingarov, Korobov, et al., 1984; value altered from reference due to conversion from electron convention to ion convention |

Gas phase ion energetics data

Data compiled by: John E. Bartmess
Electron affinity of neutral species
EAneutral (eV) | Method | Reference | Comment |
---|---|---|---|
>5.260069 | R-A | Kuznetsov, Korobov, et al., 1986 | Anchor:F-(FeF3) Chilingarov, Korobov, et al., 1984; value altered from reference due to conversion from electron convention to ion convention |

References

Kuznetsov, Korobov, et al., 1986
Kuznetsov, S.V.; Korobov, M.V.; Savinova, L.N.; Sidirov, L.N.,
Enthalpy of the addition of the F- ion to copper and iron difluorides,
Russ. J. Phys. Chem., 1986, 60, 766. [all data]
Chilingarov, Korobov, et al., 1984
Chilingarov, N.S.; Korobov, M.V.; Sidirov, L.N.; Mitkin, V.N.; Shipachev, V.A.; Zemskov, S.V.,
Electron affinity of rhodium tetrafluoride,
J. Chem. Thermodyn., 1984, 16, 965. [all data]