MeOH..MeO anion
- Formula: C2H7O2-
- Molecular weight: 63.0763

Gas phase thermochemistry data

Data compiled by: John E. Bartmess
Quantity | Value | Units | Method | Reference | Comment |
---|---|---|---|---|---|
ΔfH°gas | -451.9 ± 2.5 | kJ/mol | Ther | Meot-ner and Sieck, 1986 |

Reaction thermochemistry data

Data compiled by: John E. Bartmess
Individual Reactions
C2H7O2- + +
= C2H9O3-
By formula: C2H7O2- + H2O + CH4O = C2H9O3-
Quantity | Value | Units | Method | Reference | Comment |
---|---|---|---|---|---|
ΔrH° | 74.5 ± 4.2 | kJ/mol | TDAs | Meot-Ner(Mautner), 1986 | gas phase |
Quantity | Value | Units | Method | Reference | Comment |
ΔrG° | 42.3 ± 2.1 | kJ/mol | TDAs | Meot-Ner(Mautner), 1986 | gas phase |
C2H7O2- + 2 = C3H11O3-
By formula: C2H7O2- + 2CH4O = C3H11O3-
Quantity | Value | Units | Method | Reference | Comment |
---|---|---|---|---|---|
ΔrH° | 89.5 ± 4.2 | kJ/mol | TDAs | Meot-Ner(Mautner), 1986 | gas phase |
Quantity | Value | Units | Method | Reference | Comment |
ΔrG° | 54.8 ± 2.1 | kJ/mol | TDAs | Meot-Ner(Mautner), 1986 | gas phase |

Gas phase ion energetics data

Data compiled by: John E. Bartmess
Electron affinity of neutral species
EAneutral (eV) | Method | Reference | Comment |
---|---|---|---|
2.255 ± 0.087 | LPD | Moylan, Dodd, et al., 1985 |

Ion clustering data

Data compiled by: John E. Bartmess

Clustering reactions

C2H7O2- + 2Methyl Alcohol = C3H11O3-

By formula: C2H7O2- + 2CH4O = C3H11O3-

Quantity Value Units Method Reference Comment
Δr89.5 ± 4.2kJ/molTDAsMeot-Ner(Mautner), 1986gas phase
Quantity Value Units Method Reference Comment
Δr54.8 ± 2.1kJ/molTDAsMeot-Ner(Mautner), 1986gas phase

C2H7O2- + Water + Methyl Alcohol = C2H9O3-

By formula: C2H7O2- + H2O + CH4O = C2H9O3-

Quantity Value Units Method Reference Comment
Δr74.5 ± 4.2kJ/molTDAsMeot-Ner(Mautner), 1986gas phase
Quantity Value Units Method Reference Comment
Δr42.3 ± 2.1kJ/molTDAsMeot-Ner(Mautner), 1986gas phase

References

Meot-ner and Sieck, 1986
Meot-ner, M.; Sieck, L.W.,
Relative acidities of water and methanol, and the stabilities of the dimer adducts,
J. Phys. Chem., 1986, 90, 6687. [all data]
Meot-Ner(Mautner), 1986
Meot-Ner(Mautner), M.,
Comparative Stabilities of Cationic and Anionic Hydrogen-Bonded Networks. Mixed Clusters of Water-Methanol,
J. Am. Chem. Soc., 1986, 108, 20, 6189, https://doi.org/10.1021/ja00280a014
. [all data]
Moylan, Dodd, et al., 1985
Moylan, C.R.; Dodd, J.A.; Brauman, J.I.,
Electron photodetachment spectroscopy of Sslvated anions. A probe of structure and energetics,
Chem. Phys. Lett., 1985, 118, 38. [all data]