KCrO4 anion

Gas phase thermochemistry data

Data compiled by: John E. Bartmess

Quantity Value Units Method Reference Comment
Δfgas-994. ± 16.kJ/molTDEqRudny, Sidirov, et al., 1985value altered from reference due to conversion from electron convention to ion convention

References

Rudny, Sidirov, et al., 1985
Rudny, E.B.; Sidirov, L.N.; Kuligina, L.A.; Semenov, G.A., Heterolytic dissociation of potassium chromate in the gas phase and the electron affinity of chromium oxides, Int. J. Mass Spectrom. Ion Phys., 1985, 64, 95. [all data]