KSO4 anion
- Formula: KO4S-
- Molecular weight: 135.161

Gas phase thermochemistry data

Data compiled by: John E. Bartmess
Quantity | Value | Units | Method | Reference | Comment |
---|---|---|---|---|---|
ΔfH°gas | -235.7 ± 2.6 | kcal/mol | TDEq | Rudny, Sidorov, et al., 1985 | value altered from reference due to conversion from electron convention to ion convention |

References

Rudny, Sidorov, et al., 1985
Rudny, E.B.; Sidorov, L.N.; Voyk, O.M.,
Heterolytic Dissociation of Potassium Sulfate in the Gas Phase and Heats of Formation for Trioxosulfate(1-), Tetraoxosulfate(1-), and Potassium Sulfate(KSO4-) Ions,
High Temp., 1985, 23, 238. [all data]