HCON(Me)CH2 anion
- Formula: C3H6NO-
- Molecular weight: 72.0864

Reaction thermochemistry data

Data compiled by: John E. Bartmess
Individual Reactions
By formula: C3H6NO- + H+ = C3H7NO
Quantity | Value | Units | Method | Reference | Comment |
---|---|---|---|---|---|
ΔrH° | 1670. ± 17. | kJ/mol | G+TS | DePuy, Grabowski, et al., 1985 | gas phase |
Quantity | Value | Units | Method | Reference | Comment |
ΔrG° | 1640. ± 17. | kJ/mol | IMRB | DePuy, Grabowski, et al., 1985 | gas phase |

Gas phase ion energetics data

Data compiled by: John E. Bartmess
Protonation reactions
By formula: C3H6NO- + H+ = C3H7NO
Quantity | Value | Units | Method | Reference | Comment |
---|---|---|---|---|---|
ΔrH° | 1670. ± 17. | kJ/mol | G+TS | DePuy, Grabowski, et al., 1985 | gas phase |
Quantity | Value | Units | Method | Reference | Comment |
ΔrG° | 1640. ± 17. | kJ/mol | IMRB | DePuy, Grabowski, et al., 1985 | gas phase |

References

DePuy, Grabowski, et al., 1985
DePuy, C.H.; Grabowski, J.J.; Bierbaum, V.M.; Ingemann, S.; Nibbering, N.M.M.,
Gas-phase reactions of anions with methyl formate and N,N-dimethylformamide,
J. Am. Chem. Soc., 1985, 107, 1093. [all data]