HCSN(Me)CH2 anion
- Formula: C3H6NS-
- Molecular weight: 88.152

Gas phase ion energetics data

Data compiled by: John E. Bartmess
Protonation reactions
By formula: C3H6NS- + H+ = C3H7NS
Quantity | Value | Units | Method | Reference | Comment |
---|---|---|---|---|---|
ΔrH° | 379.4 ± 2.1 | kcal/mol | G+TS | Ingemann and Nibbering, 1985 | gas phase; value altered from reference due to change in acidity scale |
Quantity | Value | Units | Method | Reference | Comment |
ΔrG° | 372.3 ± 2.0 | kcal/mol | IMRE | Ingemann and Nibbering, 1985 | gas phase; value altered from reference due to change in acidity scale |

References

Ingemann and Nibbering, 1985
Ingemann, S.; Nibbering, N.M.M.,
Gas phase chemistry of dipole stabilized carbanions derived from N,N-dimethylthioformamide and N,N-dimethylnitrosamine,
Acta Chem. Scand., Ser. B, 1985, 39, 697. [all data]