MnF3..MnF4 anion

Gas phase thermochemistry data

Data compiled by: John E. Bartmess

Quantity Value Units Method Reference Comment
Δfgas-2510. ± 84.kJ/molTDAsKorobov, Chilingarov, et al., 1984value altered from reference due to conversion from electron convention to ion convention

References

Korobov, Chilingarov, et al., 1984
Korobov, M.V.; Chilingarov, N.S.; Igolkina, N.A.; Nikitin, M.I.; Sidorov, L.N., Molecules with a high electron affinity. Negative ions in the saturated vapor of the platinum-manganese trifluoride system, Russ. J. Phys. Chem., 1984, 58, 1368. [all data]