pCHO-benzoate anion

Reaction thermochemistry data

Data compiled by: John E. Bartmess

Individual Reactions

C8H5O3- + Hydrogen cation = Benzoic acid, 4-formyl-

By formula: C8H5O3- + H+ = C8H6O3

Quantity Value Units Method Reference Comment
Δr332.8 ± 2.1kcal/molG+TSTaft and Topsom, 1987gas phase; value altered from reference due to change in acidity scale
Quantity Value Units Method Reference Comment
Δr325.8 ± 2.0kcal/molIMRETaft and Topsom, 1987gas phase; value altered from reference due to change in acidity scale

Gas phase ion energetics data

Data compiled by: John E. Bartmess

Electron affinity of neutral species

EAneutral (eV) Method Reference Comment
4.07 ± 0.16D-EATaft and Topsom, 1987value altered from reference due to change in acidity scale

Protonation reactions

C8H5O3- + Hydrogen cation = Benzoic acid, 4-formyl-

By formula: C8H5O3- + H+ = C8H6O3

Quantity Value Units Method Reference Comment
Δr332.8 ± 2.1kcal/molG+TSTaft and Topsom, 1987gas phase; value altered from reference due to change in acidity scale
Quantity Value Units Method Reference Comment
Δr325.8 ± 2.0kcal/molIMRETaft and Topsom, 1987gas phase; value altered from reference due to change in acidity scale

References

Taft and Topsom, 1987
Taft, R.W.; Topsom, R.D., The Nature and Analysis of Substituent Effects, Prog. Phys. Org. Chem., 1987, 16, 1. [all data]