4-CO2Me-cubane-CO2 anion
- Formula: C11H9O4-
- Molecular weight: 205.1873

Reaction thermochemistry data

Data compiled by: John E. Bartmess
Individual Reactions
C11H9O4- + = C11H10O4
By formula: C11H9O4- + H+ = C11H10O4
Quantity | Value | Units | Method | Reference | Comment |
---|---|---|---|---|---|
ΔrH° | 337.7 ± 2.2 | kcal/mol | G+TS | Taft, 1987 | gas phase; value altered from reference due to change in acidity scale |
Quantity | Value | Units | Method | Reference | Comment |
ΔrG° | 330.7 ± 2.0 | kcal/mol | IMRE | Taft, 1987 | gas phase; value altered from reference due to change in acidity scale |

References

Taft, 1987
Taft, R.W.,
The Nature and Analysis of Substitutent Electronic Effects,
Personal communication. See also Prog. Phys. Org. Chem., 1987, 16, 1. [all data]