4-CO2Et-bicyclo[2.2.2]octene-CO2 anion

Gas phase ion energetics data

Data compiled by: John E. Bartmess

Electron affinity of neutral species

EAneutral (eV) Method Reference Comment
3.80 ± 0.16D-EATaft and Topsom, 1987value altered from reference due to change in acidity scale

Protonation reactions

C12H15O4- + Hydrogen cation = C12H16O4

By formula: C12H15O4- + H+ = C12H16O4

Quantity Value Units Method Reference Comment
Δr1418. ± 8.8kJ/molG+TSTaft and Topsom, 1987gas phase; value altered from reference due to change in acidity scale
Quantity Value Units Method Reference Comment
Δr1389. ± 8.4kJ/molIMRETaft and Topsom, 1987gas phase; value altered from reference due to change in acidity scale

Reaction thermochemistry data

Data compiled by: John E. Bartmess

Individual Reactions

C12H15O4- + Hydrogen cation = C12H16O4

By formula: C12H15O4- + H+ = C12H16O4

Quantity Value Units Method Reference Comment
Δr1418. ± 8.8kJ/molG+TSTaft and Topsom, 1987gas phase; value altered from reference due to change in acidity scale
Quantity Value Units Method Reference Comment
Δr1389. ± 8.4kJ/molIMRETaft and Topsom, 1987gas phase; value altered from reference due to change in acidity scale

References

Taft and Topsom, 1987
Taft, R.W.; Topsom, R.D., The Nature and Analysis of Substituent Effects, Prog. Phys. Org. Chem., 1987, 16, 1. [all data]