2-CN-bicyclo[2.2.2]octane-CO2 anion
- Formula: C10H12NO2-
- Molecular weight: 178.2083

Reaction thermochemistry data

Data compiled by: John E. Bartmess
Individual Reactions
C10H12NO2- + = C10H13NO2
By formula: C10H12NO2- + H+ = C10H13NO2
Quantity | Value | Units | Method | Reference | Comment |
---|---|---|---|---|---|
ΔrH° | 335.9 ± 2.2 | kcal/mol | G+TS | Taft, 1987 | gas phase; value altered from reference due to change in acidity scale |
Quantity | Value | Units | Method | Reference | Comment |
ΔrG° | 328.9 ± 2.0 | kcal/mol | IMRE | Taft, 1987 | gas phase; value altered from reference due to change in acidity scale |

References

Taft, 1987
Taft, R.W.,
The Nature and Analysis of Substitutent Electronic Effects,
Personal communication. See also Prog. Phys. Org. Chem., 1987, 16, 1. [all data]