3-Cl-bicyclo[2.2.2]octane-CO2 anion
- Formula: C9H12ClO2-
- Molecular weight: 187.644

Reaction thermochemistry data

Data compiled by: John E. Bartmess
Individual Reactions
C9H12ClO2- + = C9H13ClO2
By formula: C9H12ClO2- + H+ = C9H13ClO2
Quantity | Value | Units | Method | Reference | Comment |
---|---|---|---|---|---|
ΔrH° | 1423. ± 9.2 | kJ/mol | G+TS | Taft, 1987 | gas phase; value altered from reference due to change in acidity scale |
Quantity | Value | Units | Method | Reference | Comment |
ΔrG° | 1394. ± 8.4 | kJ/mol | IMRE | Taft, 1987 | gas phase; value altered from reference due to change in acidity scale |

Gas phase ion energetics data

Data compiled by: John E. Bartmess
Electron affinity of neutral species
EAneutral (eV) | Method | Reference | Comment |
---|---|---|---|
3.75 ± 0.16 | D-EA | Taft, 1987 | value altered from reference due to change in acidity scale |
Protonation reactions
C9H12ClO2- + = C9H13ClO2
By formula: C9H12ClO2- + H+ = C9H13ClO2
Quantity | Value | Units | Method | Reference | Comment |
---|---|---|---|---|---|
ΔrH° | 1423. ± 9.2 | kJ/mol | G+TS | Taft, 1987 | gas phase; value altered from reference due to change in acidity scale |
Quantity | Value | Units | Method | Reference | Comment |
ΔrG° | 1394. ± 8.4 | kJ/mol | IMRE | Taft, 1987 | gas phase; value altered from reference due to change in acidity scale |

References

Taft, 1987
Taft, R.W.,
The Nature and Analysis of Substitutent Electronic Effects,
Personal communication. See also Prog. Phys. Org. Chem., 1987, 16, 1. [all data]