4-F-bicyclo[2.2.2]octane-CO2 anion
- Formula: C9H12FO2-
- Molecular weight: 171.1893

Reaction thermochemistry data

Data compiled by: John E. Bartmess
Individual Reactions
C9H12FO2- + = C9H13FO2
By formula: C9H12FO2- + H+ = C9H13FO2
Quantity | Value | Units | Method | Reference | Comment |
---|---|---|---|---|---|
ΔrH° | 338.6 ± 2.2 | kcal/mol | G+TS | Taft and Topsom, 1987 | gas phase; value altered from reference due to change in acidity scale |
Quantity | Value | Units | Method | Reference | Comment |
ΔrG° | 331.6 ± 2.0 | kcal/mol | IMRE | Taft and Topsom, 1987 | gas phase; value altered from reference due to change in acidity scale |

Gas phase ion energetics data

Data compiled by: John E. Bartmess
Electron affinity of neutral species
EAneutral (eV) | Method | Reference | Comment |
---|---|---|---|
3.82 ± 0.16 | D-EA | Taft and Topsom, 1987 | value altered from reference due to change in acidity scale |
Protonation reactions
C9H12FO2- + = C9H13FO2
By formula: C9H12FO2- + H+ = C9H13FO2
Quantity | Value | Units | Method | Reference | Comment |
---|---|---|---|---|---|
ΔrH° | 338.6 ± 2.2 | kcal/mol | G+TS | Taft and Topsom, 1987 | gas phase; value altered from reference due to change in acidity scale |
Quantity | Value | Units | Method | Reference | Comment |
ΔrG° | 331.6 ± 2.0 | kcal/mol | IMRE | Taft and Topsom, 1987 | gas phase; value altered from reference due to change in acidity scale |

References

Taft and Topsom, 1987
Taft, R.W.; Topsom, R.D.,
The Nature and Analysis of Substituent Effects,
Prog. Phys. Org. Chem., 1987, 16, 1. [all data]