SeF3 anion
- Formula: F3Se-
- Molecular weight: 135.96

Gas phase thermochemistry data

Data compiled by: John E. Bartmess
Quantity | Value | Units | Method | Reference | Comment |
---|---|---|---|---|---|
ΔfH°gas | -774.04 | kJ/mol | EIAE | Brion, 1969 | From SeF6. G2MP2 calculations indicate an EA of ca. 3.3 eV, and HOF(A-) = -194 kcal/mol. |

References

Brion, 1969
Brion, C.E.,
Negative Ion Formation in the Hexafluorides of Sulphur, Selenium, and Tellurium,
Int. J. Mass Spectrom. Ion Phys., 1969, 3, 3-4, 197, https://doi.org/10.1016/0020-7381(69)85003-5
. [all data]