4-CF3-bicyclo[2.2.2]octane-CO2 anion
- Formula: C10H12F3O2-
- Molecular weight: 221.1968

Reaction thermochemistry data

Data compiled by: John E. Bartmess
Individual Reactions
C10H12F3O2- + = C10H13F3O2
By formula: C10H12F3O2- + H+ = C10H13F3O2
Quantity | Value | Units | Method | Reference | Comment |
---|---|---|---|---|---|
ΔrH° | 337.7 ± 2.2 | kcal/mol | G+TS | Taft and Topsom, 1987 | gas phase; value altered from reference due to change in acidity scale |
Quantity | Value | Units | Method | Reference | Comment |
ΔrG° | 330.7 ± 2.0 | kcal/mol | IMRE | Taft and Topsom, 1987 | gas phase; value altered from reference due to change in acidity scale |

Gas phase ion energetics data

Data compiled by: John E. Bartmess
Electron affinity of neutral species
EAneutral (eV) | Method | Reference | Comment |
---|---|---|---|
3.86 ± 0.16 | D-EA | Taft and Topsom, 1987 | value altered from reference due to change in acidity scale |
Protonation reactions
C10H12F3O2- + = C10H13F3O2
By formula: C10H12F3O2- + H+ = C10H13F3O2
Quantity | Value | Units | Method | Reference | Comment |
---|---|---|---|---|---|
ΔrH° | 337.7 ± 2.2 | kcal/mol | G+TS | Taft and Topsom, 1987 | gas phase; value altered from reference due to change in acidity scale |
Quantity | Value | Units | Method | Reference | Comment |
ΔrG° | 330.7 ± 2.0 | kcal/mol | IMRE | Taft and Topsom, 1987 | gas phase; value altered from reference due to change in acidity scale |

References

Taft and Topsom, 1987
Taft, R.W.; Topsom, R.D.,
The Nature and Analysis of Substituent Effects,
Prog. Phys. Org. Chem., 1987, 16, 1. [all data]