bicyclo[2.2.2]octane-CO2 anion
- Formula: C9H13O2-
- Molecular weight: 153.1989

Gas phase ion energetics data

Data compiled by: John E. Bartmess
Electron affinity of neutral species
EAneutral (eV) | Method | Reference | Comment |
---|---|---|---|
3.57 ± 0.16 | D-EA | Taft and Topsom, 1987 | value altered from reference due to change in acidity scale |
Protonation reactions
By formula: C9H13O2- + H+ = C9H14O2
Quantity | Value | Units | Method | Reference | Comment |
---|---|---|---|---|---|
ΔrH° | 344.2 ± 2.1 | kcal/mol | G+TS | Taft and Topsom, 1987 | gas phase; value altered from reference due to change in acidity scale |
Quantity | Value | Units | Method | Reference | Comment |
ΔrG° | 337.2 ± 2.0 | kcal/mol | IMRE | Taft and Topsom, 1987 | gas phase; value altered from reference due to change in acidity scale |

Reaction thermochemistry data

Data compiled by: John E. Bartmess

Individual Reactions

C9H13O2- + Hydrogen cation = Bicyclo[2.2.2]octane-1-carboxylic acid

By formula: C9H13O2- + H+ = C9H14O2

Quantity Value Units Method Reference Comment
Δr1440. ± 8.8kJ/molG+TSTaft and Topsom, 1987gas phase; value altered from reference due to change in acidity scale
Quantity Value Units Method Reference Comment
Δr1411. ± 8.4kJ/molIMRETaft and Topsom, 1987gas phase; value altered from reference due to change in acidity scale

References

Taft and Topsom, 1987
Taft, R.W.; Topsom, R.D.,
The Nature and Analysis of Substituent Effects,
Prog. Phys. Org. Chem., 1987, 16, 1. [all data]