2-Ph-5-pCl-C6H4-cyclopentadienide anion
- Formula: C17H12Cl-
- Molecular weight: 251.731

Reaction thermochemistry data

Data compiled by: John E. Bartmess
Individual Reactions
C17H12Cl- + = C17H13Cl
By formula: C17H12Cl- + H+ = C17H13Cl
Quantity | Value | Units | Method | Reference | Comment |
---|---|---|---|---|---|
ΔrH° | 336.2 ± 2.1 | kcal/mol | G+TS | Taft, 1987 | gas phase; value altered from reference due to change in acidity scale |
Quantity | Value | Units | Method | Reference | Comment |
ΔrG° | 328.8 ± 2.0 | kcal/mol | IMRE | Taft, 1987 | gas phase; value altered from reference due to change in acidity scale |

Gas phase ion energetics data

Data compiled by: John E. Bartmess

Protonation reactions

C17H12Cl- + Hydrogen cation = C17H13Cl

By formula: C17H12Cl- + H+ = C17H13Cl

Quantity Value Units Method Reference Comment
Δr1407. ± 8.8kJ/molG+TSTaft, 1987gas phase; value altered from reference due to change in acidity scale
Quantity Value Units Method Reference Comment
Δr1376. ± 8.4kJ/molIMRETaft, 1987gas phase; value altered from reference due to change in acidity scale

References

Taft, 1987
Taft, R.W.,
The Nature and Analysis of Substitutent Electronic Effects,
Personal communication. See also Prog. Phys. Org. Chem., 1987, 16, 1. [all data]