CF3SO2CH=CHCH2 anion

Reaction thermochemistry data

Data compiled by: John E. Bartmess

Individual Reactions

C4H4F3O2S- + Hydrogen cation = C4H5F3O2S

By formula: C4H4F3O2S- + H+ = C4H5F3O2S

Quantity Value Units Method Reference Comment
Δr1436. ± 8.8kJ/molG+TSTaft, 1987gas phase; Acid = CF3SO2CH2CH=CH2; value altered from reference due to change in acidity scale
Quantity Value Units Method Reference Comment
Δr1407. ± 8.4kJ/molIMRETaft, 1987gas phase; Acid = CF3SO2CH2CH=CH2; value altered from reference due to change in acidity scale

References

Taft, 1987
Taft, R.W., The Nature and Analysis of Substitutent Electronic Effects, Personal communication. See also Prog. Phys. Org. Chem., 1987, 16, 1. [all data]