4-Me-pyrazolide anion
- Formula: C4H5N2-
- Molecular weight: 81.0964

Reaction thermochemistry data

Data compiled by: John E. Bartmess
Individual Reactions
By formula: C4H5N2- + H+ = C4H6N2
Quantity | Value | Units | Method | Reference | Comment |
---|---|---|---|---|---|
ΔrH° | 354.7 ± 2.1 | kcal/mol | G+TS | Taft, 1987 | gas phase; value altered from reference due to change in acidity scale |
Quantity | Value | Units | Method | Reference | Comment |
ΔrG° | 347.4 ± 2.0 | kcal/mol | IMRE | Taft, 1987 | gas phase; value altered from reference due to change in acidity scale |

Gas phase ion energetics data

Data compiled by: John E. Bartmess

Protonation reactions

C4H5N2- + Hydrogen cation = Fomepizole

By formula: C4H5N2- + H+ = C4H6N2

Quantity Value Units Method Reference Comment
Δr1484. ± 8.8kJ/molG+TSTaft, 1987gas phase; value altered from reference due to change in acidity scale
Quantity Value Units Method Reference Comment
Δr1454. ± 8.4kJ/molIMRETaft, 1987gas phase; value altered from reference due to change in acidity scale

References

Taft, 1987
Taft, R.W.,
The Nature and Analysis of Substitutent Electronic Effects,
Personal communication. See also Prog. Phys. Org. Chem., 1987, 16, 1. [all data]