HN=C(NMe2)O anion
- Formula: C3H7N2O-
- Molecular weight: 87.1010

Reaction thermochemistry data

Data compiled by: John E. Bartmess
Individual Reactions
By formula: C3H7N2O- + H+ = C3H8N2O
Quantity | Value | Units | Method | Reference | Comment |
---|---|---|---|---|---|
ΔrH° | 361.8 ± 2.5 | kcal/mol | G+TS | Taft, 1987 | gas phase; value altered from reference due to change in acidity scale |
Quantity | Value | Units | Method | Reference | Comment |
ΔrG° | 354.8 ± 2.4 | kcal/mol | IMRE | Taft, 1987 | gas phase; value altered from reference due to change in acidity scale |

References

Taft, 1987
Taft, R.W.,
The Nature and Analysis of Substitutent Electronic Effects,
Personal communication. See also Prog. Phys. Org. Chem., 1987, 16, 1. [all data]