CrO2Cl anion

Gas phase thermochemistry data

Data compiled by: John E. Bartmess

Quantity Value Units Method Reference Comment
Δfgas-531. ± 50.kJ/molEIAEFlesch, White, et al., 1969From CrO2Cl2

References

Flesch, White, et al., 1969
Flesch, G.D.; White, R.M.; Svec, H.J., The Positive and Negative Ion Mass Spectra of Chromyl Chloride and Chromyl Fluoride, Int. J. Mass Spectrom. Ion Phys., 1969, 3, 5, 239, https://doi.org/10.1016/0020-7381(69)80079-3 . [all data]