3-Cl-1-adamantane-CO2 anion
- Formula: C11H14ClO2-
- Molecular weight: 213.681

Reaction thermochemistry data

Data compiled by: John E. Bartmess
Individual Reactions
C11H14ClO2- + = C11H15ClO2
By formula: C11H14ClO2- + H+ = C11H15ClO2
Quantity | Value | Units | Method | Reference | Comment |
---|---|---|---|---|---|
ΔrH° | 338.4 ± 2.1 | kcal/mol | G+TS | Taft, 1987 | gas phase; value altered from reference due to change in acidity scale |
Quantity | Value | Units | Method | Reference | Comment |
ΔrG° | 331.4 ± 2.0 | kcal/mol | IMRE | Taft, 1987 | gas phase; value altered from reference due to change in acidity scale |

References

Taft, 1987
Taft, R.W.,
The Nature and Analysis of Substitutent Electronic Effects,
Personal communication. See also Prog. Phys. Org. Chem., 1987, 16, 1. [all data]