1-adamantyl-CO2 anion

Gas phase ion energetics data

Data compiled by: John E. Bartmess

Electron affinity of neutral species

EAneutral (eV) Method Reference Comment
3.63 ± 0.16D-EACaldwell, Renneboog, et al., 1989

Protonation reactions

C11H15O2- + Hydrogen cation = Adamantane-1-carboxylic acid

By formula: C11H15O2- + H+ = C11H16O2

Quantity Value Units Method Reference Comment
Δr1435. ± 8.8kJ/molG+TSCaldwell, Renneboog, et al., 1989gas phase
Δr1438. ± 8.8kJ/molG+TSJinfeng, Topsom, et al., 1988gas phase; value altered from reference due to change in acidity scale
Quantity Value Units Method Reference Comment
Δr1406. ± 8.4kJ/molIMRECaldwell, Renneboog, et al., 1989gas phase
Δr1408. ± 8.4kJ/molIMREJinfeng, Topsom, et al., 1988gas phase; value altered from reference due to change in acidity scale

Reaction thermochemistry data

Data compiled by: John E. Bartmess

Individual Reactions

C11H15O2- + Hydrogen cation = Adamantane-1-carboxylic acid

By formula: C11H15O2- + H+ = C11H16O2

Quantity Value Units Method Reference Comment
Δr1435. ± 8.8kJ/molG+TSCaldwell, Renneboog, et al., 1989gas phase
Δr1438. ± 8.8kJ/molG+TSJinfeng, Topsom, et al., 1988gas phase; value altered from reference due to change in acidity scale
Quantity Value Units Method Reference Comment
Δr1406. ± 8.4kJ/molIMRECaldwell, Renneboog, et al., 1989gas phase
Δr1408. ± 8.4kJ/molIMREJinfeng, Topsom, et al., 1988gas phase; value altered from reference due to change in acidity scale

References

Caldwell, Renneboog, et al., 1989
Caldwell, G.; Renneboog, R.; Kebarle, P., Gas Phase Acidities of Aliphatic Carboxylic Acids, Based on Measurements of Proton Transfer Equilibria, Can. J. Chem., 1989, 67, 4, 661, https://doi.org/10.1139/v89-092 . [all data]

Jinfeng, Topsom, et al., 1988
Jinfeng, C.; Topsom, R.D.; Headley, A.D.; Koppel, I.; Mishima, M.; Taft, R.W.; Veji, S., Acidities of Substituted Acetic Acids, J. Mol. Struct., 1988, 168, 141, https://doi.org/10.1016/0166-1280(88)80349-X . [all data]