cC6H11-CH2CO2 anion
- Formula: C8H13O2-
- Molecular weight: 141.1882

Reaction thermochemistry data

Data compiled by: John E. Bartmess
Individual Reactions
By formula: C8H13O2- + H+ = C8H14O2
Quantity | Value | Units | Method | Reference | Comment |
---|---|---|---|---|---|
ΔrH° | 1445. ± 8.8 | kJ/mol | G+TS | Caldwell, Renneboog, et al., 1989 | gas phase |
ΔrH° | 1444. ± 8.8 | kJ/mol | G+TS | Jinfeng, Topsom, et al., 1988 | gas phase; value altered from reference due to change in acidity scale |
Quantity | Value | Units | Method | Reference | Comment |
ΔrG° | 1415. ± 8.4 | kJ/mol | IMRE | Caldwell, Renneboog, et al., 1989 | gas phase |
ΔrG° | 1415. ± 8.4 | kJ/mol | IMRE | Jinfeng, Topsom, et al., 1988 | gas phase; value altered from reference due to change in acidity scale |

Gas phase ion energetics data

Data compiled by: John E. Bartmess
Electron affinity of neutral species
EAneutral (eV) | Method | Reference | Comment |
---|---|---|---|
3.53 ± 0.16 | D-EA | Caldwell, Renneboog, et al., 1989 |
Protonation reactions
By formula: C8H13O2- + H+ = C8H14O2
Quantity | Value | Units | Method | Reference | Comment |
---|---|---|---|---|---|
ΔrH° | 1445. ± 8.8 | kJ/mol | G+TS | Caldwell, Renneboog, et al., 1989 | gas phase |
ΔrH° | 1444. ± 8.8 | kJ/mol | G+TS | Jinfeng, Topsom, et al., 1988 | gas phase; value altered from reference due to change in acidity scale |
Quantity | Value | Units | Method | Reference | Comment |
ΔrG° | 1415. ± 8.4 | kJ/mol | IMRE | Caldwell, Renneboog, et al., 1989 | gas phase |
ΔrG° | 1415. ± 8.4 | kJ/mol | IMRE | Jinfeng, Topsom, et al., 1988 | gas phase; value altered from reference due to change in acidity scale |

References

Caldwell, Renneboog, et al., 1989
Caldwell, G.; Renneboog, R.; Kebarle, P.,
Gas Phase Acidities of Aliphatic Carboxylic Acids, Based on Measurements of Proton Transfer Equilibria,
Can. J. Chem., 1989, 67, 4, 661, https://doi.org/10.1139/v89-092
. [all data]
Jinfeng, Topsom, et al., 1988
Jinfeng, C.; Topsom, R.D.; Headley, A.D.; Koppel, I.; Mishima, M.; Taft, R.W.; Veji, S.,
Acidities of Substituted Acetic Acids,
J. Mol. Struct., 1988, 168, 141, https://doi.org/10.1016/0166-1280(88)80349-X
. [all data]