mCF3-C6H4-CH(Ph) anion

Reaction thermochemistry data

Data compiled by: John E. Bartmess

Individual Reactions

C14H10F3- + Hydrogen cation = 3-Trifluoromethyldiphenylmethane

By formula: C14H10F3- + H+ = C14H11F3

Quantity Value Units Method Reference Comment
Δr1484. ± 8.8kJ/molG+TSTaft, 1987gas phase; value altered from reference due to change in acidity scale
Quantity Value Units Method Reference Comment
Δr1462. ± 8.4kJ/molIMRETaft, 1987gas phase; value altered from reference due to change in acidity scale

Gas phase ion energetics data

Data compiled by: John E. Bartmess

Protonation reactions

C14H10F3- + Hydrogen cation = 3-Trifluoromethyldiphenylmethane

By formula: C14H10F3- + H+ = C14H11F3

Quantity Value Units Method Reference Comment
Δr354.8 ± 2.1kcal/molG+TSTaft, 1987gas phase; value altered from reference due to change in acidity scale
Quantity Value Units Method Reference Comment
Δr349.4 ± 2.0kcal/molIMRETaft, 1987gas phase; value altered from reference due to change in acidity scale

References

Taft, 1987
Taft, R.W., The Nature and Analysis of Substitutent Electronic Effects, Personal communication. See also Prog. Phys. Org. Chem., 1987, 16, 1. [all data]