pCOCF3-C6H4CH2 anion
- Formula: C9H6F3O-
- Molecular weight: 187.1391

Gas phase ion energetics data

Data compiled by: John E. Bartmess
Protonation reactions
By formula: C9H6F3O- + H+ = C9H7F3O
Quantity | Value | Units | Method | Reference | Comment |
---|---|---|---|---|---|
ΔrH° | 351.2 ± 2.1 | kcal/mol | G+TS | Taft and Topsom, 1987 | gas phase; value altered from reference due to change in acidity scale |
Quantity | Value | Units | Method | Reference | Comment |
ΔrG° | 344.0 ± 2.0 | kcal/mol | IMRE | Taft and Topsom, 1987 | gas phase; value altered from reference due to change in acidity scale |

Reaction thermochemistry data

Data compiled by: John E. Bartmess

Individual Reactions

C9H6F3O- + Hydrogen cation = 4-(Trifluoroacetyl)toluene

By formula: C9H6F3O- + H+ = C9H7F3O

Quantity Value Units Method Reference Comment
Δr1469. ± 8.8kJ/molG+TSTaft and Topsom, 1987gas phase; value altered from reference due to change in acidity scale
Quantity Value Units Method Reference Comment
Δr1439. ± 8.4kJ/molIMRETaft and Topsom, 1987gas phase; value altered from reference due to change in acidity scale

References

Taft and Topsom, 1987
Taft, R.W.; Topsom, R.D.,
The Nature and Analysis of Substituent Effects,
Prog. Phys. Org. Chem., 1987, 16, 1. [all data]