MeSiCl2 anion
- Formula: CH3Cl2Si-
- Molecular weight: 114.027

Gas phase ion energetics data

Data compiled by: John E. Bartmess
Protonation reactions
By formula: CH3Cl2Si- + H+ = CH4Cl2Si
Quantity | Value | Units | Method | Reference | Comment |
---|---|---|---|---|---|
ΔrH° | 436.8 ± 5.9 | kcal/mol | Acid | Jaeger and Henglein, 1968 | gas phase; From MeSiCl3, probably ca. 75 kcal too unstable |

References

Jaeger and Henglein, 1968
Jaeger, K.; Henglein, A.,
Die Bildung negativer Ionen aus SiCl4 und organischen Siliciumchloriden durch Elektronenstoss,
Z. Naturfor., 1968, 23A, 1122. [all data]