indenide anion
- Formula: C9H7-
- Molecular weight: 115.1524
- IUPAC Standard InChIKey: RREAVEQOCKXSHQ-UHFFFAOYSA-N
- Chemical structure:
View 3d structure (requires JavaScript / HTML 5) - Permanent link for this species. Use this link for bookmarking this species for future reference.

Reaction thermochemistry data

Data compiled by: John E. Bartmess
Individual Reactions
Quantity | Value | Units | Method | Reference | Comment |
---|---|---|---|---|---|
ΔrH° | 1482. ± 10. | kJ/mol | TDEq | Meot-ner, Liebman, et al., 1988 | gas phase; anchored to 88MEO scale, not the "87 acidity scale". The Kiefer, Zhang, et al., 1997 BDE is for ortho. |
ΔrH° | 1472. ± 8.8 | kJ/mol | G+TS | Taft and Bordwell, 1988 | gas phase |
Quantity | Value | Units | Method | Reference | Comment |
ΔrG° | 1451. ± 8.4 | kJ/mol | TDEq | Meot-ner, Liebman, et al., 1988 | gas phase; anchored to 88MEO scale, not the "87 acidity scale". The Kiefer, Zhang, et al., 1997 BDE is for ortho. |
ΔrG° | 1442. ± 8.4 | kJ/mol | IMRE | Taft and Bordwell, 1988 | gas phase |

Gas phase ion energetics data

Data compiled by: John E. Bartmess
Protonation reactions
Quantity | Value | Units | Method | Reference | Comment |
---|---|---|---|---|---|
ΔrH° | 1482. ± 10. | kJ/mol | TDEq | Meot-ner, Liebman, et al., 1988 | gas phase; anchored to 88MEO scale, not the "87 acidity scale". The Kiefer, Zhang, et al., 1997 BDE is for ortho. |
ΔrH° | 1472. ± 8.8 | kJ/mol | G+TS | Taft and Bordwell, 1988 | gas phase |
Quantity | Value | Units | Method | Reference | Comment |
ΔrG° | 1451. ± 8.4 | kJ/mol | TDEq | Meot-ner, Liebman, et al., 1988 | gas phase; anchored to 88MEO scale, not the "87 acidity scale". The Kiefer, Zhang, et al., 1997 BDE is for ortho. |
ΔrG° | 1442. ± 8.4 | kJ/mol | IMRE | Taft and Bordwell, 1988 | gas phase |

References

Meot-ner, Liebman, et al., 1988
Meot-ner, M.; Liebman, J.F.; Kafafi, S.A.,
Ionic Probes of Aromaticity in Annelated Rings,
J. Am. Chem. Soc., 1988, 110, 18, 5937, https://doi.org/10.1021/ja00226a001
. [all data]
Kiefer, Zhang, et al., 1997
Kiefer, J.H.; Zhang, Q.; Kern, R.D.; Yao, J.; Jursic, B.,
Pyrolysis of Aromatic Azines: Pyrazine, Pyrimidine, and Pyridine,
J. Phys. Chem. A, 1997, 101, 38, 7061, https://doi.org/10.1021/jp970211z
. [all data]
Taft and Bordwell, 1988
Taft, R.W.; Bordwell, F.G.,
Structural and Solvent Effects Evaluated from Acidities Measured in Dimethyl Sulfoxide and in the Gas Phase,
Acc. Chem. Res., 1988, 21, 12, 463, https://doi.org/10.1021/ar00156a005
. [all data]