F2O2P-
- Formula: F2O2P-
- Molecular weight: 100.9699

Reaction thermochemistry data

Data compiled by: John E. Bartmess
Individual Reactions
F2O2P- + AlF4Na = (F2O2P- • AlF4Na)
By formula: F2O2P- + AlF4Na = (F2O2P- • AlF4Na)
Quantity | Value | Units | Method | Reference | Comment |
---|---|---|---|---|---|
ΔrH° | 189. ± 21. | kJ/mol | N/A | Mavrin, Miletich, et al., 1989 | gas phase; ΔHf(A-) at 0 K; value altered from reference due to conversion from electron convention to ion convention |
F2O2P- + AlF4K = (F2O2P- • AlF4K)
By formula: F2O2P- + AlF4K = (F2O2P- • AlF4K)
Quantity | Value | Units | Method | Reference | Comment |
---|---|---|---|---|---|
ΔrH° | 177. ± 21. | kJ/mol | N/A | Mavrin, Miletich, et al., 1989 | gas phase; ΔHf(A-) at 0 K; value altered from reference due to conversion from electron convention to ion convention |
F2O2P- + F2NaO2P = (F2O2P- • F2NaO2P)
By formula: F2O2P- + F2NaO2P = (F2O2P- • F2NaO2P)
Quantity | Value | Units | Method | Reference | Comment |
---|---|---|---|---|---|
ΔrH° | 240. ± 84. | kJ/mol | TDEq | Mavrin, Miletich, et al., 1989 | gas phase; value altered from reference due to conversion from electron convention to ion convention |

Ion clustering data

Data compiled by: John E. Bartmess
Clustering reactions
F2O2P- + AlF4K = (F2O2P- • AlF4K)
By formula: F2O2P- + AlF4K = (F2O2P- • AlF4K)
Quantity | Value | Units | Method | Reference | Comment |
---|---|---|---|---|---|
ΔrH° | 177. ± 21. | kJ/mol | N/A | Mavrin, Miletich, et al., 1989 | gas phase; ΔHf(A-) at 0 K; value altered from reference due to conversion from electron convention to ion convention |
F2O2P- + AlF4Na = (F2O2P- • AlF4Na)
By formula: F2O2P- + AlF4Na = (F2O2P- • AlF4Na)
Quantity | Value | Units | Method | Reference | Comment |
---|---|---|---|---|---|
ΔrH° | 189. ± 21. | kJ/mol | N/A | Mavrin, Miletich, et al., 1989 | gas phase; ΔHf(A-) at 0 K; value altered from reference due to conversion from electron convention to ion convention |
F2O2P- + F2NaO2P = (F2O2P- • F2NaO2P)
By formula: F2O2P- + F2NaO2P = (F2O2P- • F2NaO2P)
Quantity | Value | Units | Method | Reference | Comment |
---|---|---|---|---|---|
ΔrH° | 240. ± 84. | kJ/mol | TDEq | Mavrin, Miletich, et al., 1989 | gas phase; value altered from reference due to conversion from electron convention to ion convention |

References

Mavrin, Miletich, et al., 1989
Mavrin, A.A.; Miletich, M.; Korobov, M.V.; Zmbov, K.; Sidorov, L.N.,
Mass-spectroscopic Thermodynamic Study of the Negative Ions of Phosphorous Oxide Fluorides,
Russ. J. Phys. Chem., 1989, 63, 500. [all data]