cyclooctenide anion
- Formula: C8H13-
- Molecular weight: 109.1894
- IUPAC Standard InChIKey: LEWMWCUBPUHKBZ-UPHRSURJSA-N
- Chemical structure:
View 3d structure (requires JavaScript / HTML 5) - Permanent link for this species. Use this link for bookmarking this species for future reference.

Reaction thermochemistry data

Data compiled by: John E. Bartmess
Individual Reactions
By formula: C8H13- + H+ = C8H14
Quantity | Value | Units | Method | Reference | Comment |
---|---|---|---|---|---|
ΔrH° | 1617. ± 21. | kJ/mol | G+TS | Lee and Squires, 1986 | gas phase; Between H2O, MeOH |
Quantity | Value | Units | Method | Reference | Comment |
ΔrG° | 1586. ± 21. | kJ/mol | IMRB | Lee and Squires, 1986 | gas phase; Between H2O, MeOH |

Gas phase ion energetics data

Data compiled by: John E. Bartmess
Protonation reactions
By formula: C8H13- + H+ = C8H14
Quantity | Value | Units | Method | Reference | Comment |
---|---|---|---|---|---|
ΔrH° | 1617. ± 21. | kJ/mol | G+TS | Lee and Squires, 1986 | gas phase; Between H2O, MeOH |
Quantity | Value | Units | Method | Reference | Comment |
ΔrG° | 1586. ± 21. | kJ/mol | IMRB | Lee and Squires, 1986 | gas phase; Between H2O, MeOH |

References

Lee and Squires, 1986
Lee, R.E.; Squires, R.R.,
Anionic homoaromaticity: A gas phase experimental study,
J. Am. Chem. Soc., 1986, 105, 5078. [all data]