cyclooctadienide anion
- Formula: C8H11-
- Molecular weight: 107.1735

Gas phase ion energetics data

Data compiled by: John E. Bartmess
Protonation reactions
By formula: C8H11- + H+ = C8H12
Quantity | Value | Units | Method | Reference | Comment |
---|---|---|---|---|---|
ΔrH° | 1576. ± 13. | kJ/mol | G+TS | Lee and Squires, 1986 | gas phase; Between EtOH, nPrOH; value altered from reference due to change in acidity scale |
Quantity | Value | Units | Method | Reference | Comment |
ΔrG° | 1548. ± 13. | kJ/mol | IMRB | Lee and Squires, 1986 | gas phase; Between EtOH, nPrOH; value altered from reference due to change in acidity scale |

References

Lee and Squires, 1986
Lee, R.E.; Squires, R.R.,
Anionic homoaromaticity: A gas phase experimental study,
J. Am. Chem. Soc., 1986, 105, 5078. [all data]