norbornenide anion
- Formula: C7H9-
- Molecular weight: 93.1469
- IUPAC Standard InChIKey: SQRPSGZTPNZJQH-UHFFFAOYSA-N
- Chemical structure:
View 3d structure (requires JavaScript / HTML 5) - Permanent link for this species. Use this link for bookmarking this species for future reference.

Reaction thermochemistry data

Data compiled by: John E. Bartmess
Individual Reactions
By formula: C7H9- + H+ = C7H10
Quantity | Value | Units | Method | Reference | Comment |
---|---|---|---|---|---|
ΔrH° | 1682. ± 13. | kJ/mol | G+TS | Lee and Squires, 1986 | gas phase; Between NH3, EtNH2. Assigned as vinylic site by authors. |
Quantity | Value | Units | Method | Reference | Comment |
ΔrG° | 1648. ± 13. | kJ/mol | IMRB | Lee and Squires, 1986 | gas phase; Between NH3, EtNH2. Assigned as vinylic site by authors. |

Gas phase ion energetics data

Data compiled by: John E. Bartmess
Protonation reactions
By formula: C7H9- + H+ = C7H10
Quantity | Value | Units | Method | Reference | Comment |
---|---|---|---|---|---|
ΔrH° | 1682. ± 13. | kJ/mol | G+TS | Lee and Squires, 1986 | gas phase; Between NH3, EtNH2. Assigned as vinylic site by authors. |
Quantity | Value | Units | Method | Reference | Comment |
ΔrG° | 1648. ± 13. | kJ/mol | IMRB | Lee and Squires, 1986 | gas phase; Between NH3, EtNH2. Assigned as vinylic site by authors. |

References

Lee and Squires, 1986
Lee, R.E.; Squires, R.R.,
Anionic homoaromaticity: A gas phase experimental study,
J. Am. Chem. Soc., 1986, 105, 5078. [all data]