bicyclo[3.2.1]octa-2,6-dien-4-ide anion

Reaction thermochemistry data

Data compiled by: John E. Bartmess

Individual Reactions

C8H9- + Hydrogen cation = Bicyclo[3.2.1]octa-2,6-diene

By formula: C8H9- + H+ = C8H10

Quantity Value Units Method Reference Comment
Δr1588. ± 8.8kJ/molG+TSLee and Squires, 1986gas phase; 1.4 kcal > MeOH; value altered from reference due to change in acidity scale
Quantity Value Units Method Reference Comment
Δr1559. ± 8.4kJ/molIMRELee and Squires, 1986gas phase; 1.4 kcal > MeOH; value altered from reference due to change in acidity scale

References

Lee and Squires, 1986
Lee, R.E.; Squires, R.R., Anionic homoaromaticity: A gas phase experimental study, J. Am. Chem. Soc., 1986, 105, 5078. [all data]