CH2=C(CH=CH2)O anion
- Formula: C4H5O-
- Molecular weight: 69.0824

Reaction thermochemistry data

Data compiled by: John E. Bartmess
Individual Reactions
By formula: C4H5O- + H+ = C4H6O
Quantity | Value | Units | Method | Reference | Comment |
---|---|---|---|---|---|
ΔrH° | 1520. ± 8.8 | kJ/mol | G+TS | Bartmess and Kiplinger, 1986 | gas phase; value altered from reference due to change in acidity scale |
Quantity | Value | Units | Method | Reference | Comment |
ΔrG° | 1492. ± 8.4 | kJ/mol | IMRE | Bartmess and Kiplinger, 1986 | gas phase; value altered from reference due to change in acidity scale |

Gas phase ion energetics data

Data compiled by: John E. Bartmess
Protonation reactions
By formula: C4H5O- + H+ = C4H6O
Quantity | Value | Units | Method | Reference | Comment |
---|---|---|---|---|---|
ΔrH° | 1520. ± 8.8 | kJ/mol | G+TS | Bartmess and Kiplinger, 1986 | gas phase; value altered from reference due to change in acidity scale |
Quantity | Value | Units | Method | Reference | Comment |
ΔrG° | 1492. ± 8.4 | kJ/mol | IMRE | Bartmess and Kiplinger, 1986 | gas phase; value altered from reference due to change in acidity scale |

References

Bartmess and Kiplinger, 1986
Bartmess, J.E.; Kiplinger, J.P.,
'Kinetic' vs. thermodynamic acidities of enones in the gas phase,
J. Org. Chem., 1986, 51, 2173. [all data]