2',3',4',5',6'-Pentafluoroacetophenone anion
- Formula: C8H3F5O-
- Molecular weight: 210.1014

Gas phase thermochemistry data

Data compiled by: John E. Bartmess
Quantity | Value | Units | Method | Reference | Comment |
---|---|---|---|---|---|
ΔfH°gas | -1052. ± 11. | kJ/mol | R-EA | Dillow and Kebarle, 1989 | ΔGea(423 K) = -21.7±1.0 kcal/mol , assumed entropy = 3.5 eu |

References

Dillow and Kebarle, 1989
Dillow, G.W.; Kebarle, P.,
Substituent Effects on the Electron Affinities of Perfluorobenzenes C6F5X,
J. Am. Chem. Soc., 1989, 111, 15, 5592, https://doi.org/10.1021/ja00197a014
. [all data]